Reaction Details
TargetCannabinoid receptor 2
LigandBDBM50340311
Substrate/Competitorn/a
Meas. Tech.ChEMBL_741484 (CHEMBL1763799)
IC50 0.7±n/a nM
Citation Trotter, BWNanda, KKBurgey, CSPotteiger, CMDeng, JZGreen, AIHartnett, JCKett, NRWu, ZHenze, DADella Penna, KDesai, RLeitl, MDLemaire, WWhite, RBYeh, SUrban, MOKane, SAHartman, GDBilodeau, MT Imidazopyridine CB2 agonists: optimization of CB2/CB1 selectivity and implications for in vivo analgesic efficacy. Bioorg Med Chem Lett21:2354-8 (2011) 
 
Cannabinoid receptor 2
Name:Cannabinoid receptor 2
Type:G Protein-Coupled Receptor (GPCR)
Mol. Mass.:39690.94
Organism:Homo sapiens (Human)
Description:P34972
Residue:360
BDBM50340311
NameBDBM50340311
Synonyms:(3-fluoro-2-(trifluoromethyl)phenyl)(1-(morpholinomethyl)imidazo[1,5-a]pyridin-3-yl)methanone | CHEMBL1760931
TypeSmall organic molecule
Emp. Form.C20H17F4N3O2
Mol. Mass.407.3615
SMILESFc1cccc(C(=O)c2nc(CN3CCOCC3)c3ccccn23)c1C(F)(F)F