Reaction Details
TargetCannabinoid receptor 2
LigandBDBM50340321
Substrate/Competitorn/a
Meas. Tech.ChEMBL_741484 (CHEMBL1763799)
IC50 36±n/a nM
Citation Trotter, BWNanda, KKBurgey, CSPotteiger, CMDeng, JZGreen, AIHartnett, JCKett, NRWu, ZHenze, DADella Penna, KDesai, RLeitl, MDLemaire, WWhite, RBYeh, SUrban, MOKane, SAHartman, GDBilodeau, MT Imidazopyridine CB2 agonists: optimization of CB2/CB1 selectivity and implications for in vivo analgesic efficacy. Bioorg Med Chem Lett21:2354-8 (2011) 
 
Cannabinoid receptor 2
Name:Cannabinoid receptor 2
Type:G Protein-Coupled Receptor (GPCR)
Mol. Mass.:39690.94
Organism:Homo sapiens (Human)
Description:P34972
Residue:360
BDBM50340321
NameBDBM50340321
Synonyms:(R)-1-(4,4-difluoropiperidin-1-yl)-N-(3,3-dimethylbutan-2-yl)imidazo[1,5-a]pyrazine-3-carboxamide | CHEMBL1760941
TypeSmall organic molecule
Emp. Form.C18H25F2N5O
Mol. Mass.365.4208
SMILESC[C@@H](NC(=O)c1nc(N2CCC(F)(F)CC2)c2cnccn12)C(C)(C)C