Reaction Details
TargetCannabinoid receptor 1
LigandBDBM50340313
Substrate/Competitorn/a
Meas. Tech.ChEMBL_741486 (CHEMBL1763801)
IC50 347±n/a nM
Citation Trotter, BWNanda, KKBurgey, CSPotteiger, CMDeng, JZGreen, AIHartnett, JCKett, NRWu, ZHenze, DADella Penna, KDesai, RLeitl, MDLemaire, WWhite, RBYeh, SUrban, MOKane, SAHartman, GDBilodeau, MT Imidazopyridine CB2 agonists: optimization of CB2/CB1 selectivity and implications for in vivo analgesic efficacy. Bioorg Med Chem Lett21:2354-8 (2011) 
 
Cannabinoid receptor 1
Name:Cannabinoid receptor 1
Type:G Protein-Coupled Receptor (GPCR)
Mol. Mass.:52868.96
Organism:Homo sapiens (Human)
Description:P21554
Residue:472
BDBM50340313
NameBDBM50340313
Synonyms:1-((4,4-difluoropiperidin-1-yl)methyl)-N-(6-(trifluoromethyl)pyridin-2-yl)imidazo[1,5-a]pyridine-3-carboxamide | CHEMBL1760933
TypeSmall organic molecule
Emp. Form.C20H18F5N5O
Mol. Mass.439.3818
SMILESFC(F)(F)c1cccc(NC(=O)c2nc(CN3CCC(F)(F)CC3)c3ccccn23)n1