Reaction Details
TargetCannabinoid receptor 1
LigandBDBM50340315
Substrate/Competitorn/a
Meas. Tech.ChEMBL_741486 (CHEMBL1763801)
IC50 68±n/a nM
Citation Trotter, BWNanda, KKBurgey, CSPotteiger, CMDeng, JZGreen, AIHartnett, JCKett, NRWu, ZHenze, DADella Penna, KDesai, RLeitl, MDLemaire, WWhite, RBYeh, SUrban, MOKane, SAHartman, GDBilodeau, MT Imidazopyridine CB2 agonists: optimization of CB2/CB1 selectivity and implications for in vivo analgesic efficacy. Bioorg Med Chem Lett21:2354-8 (2011) 
 
Cannabinoid receptor 1
Name:Cannabinoid receptor 1
Type:G Protein-Coupled Receptor (GPCR)
Mol. Mass.:52868.96
Organism:Homo sapiens (Human)
Description:P21554
Residue:472
BDBM50340315
NameBDBM50340315
Synonyms:3-((4,4-difluoropiperidin-1-yl)methyl)-N-((1-(hydroxymethyl)cyclopentyl)methyl)imidazo[1,5-a]pyridine-1-carboxamide | CHEMBL1760935
TypeSmall organic molecule
Emp. Form.C21H28F2N4O2
Mol. Mass.406.4694
SMILESOCC1(CNC(=O)c2nc(CN3CCC(F)(F)CC3)n3ccccc23)CCCC1