Reaction Details
TargetCannabinoid receptor 2
LigandBDBM50340319
Substrate/Competitorn/a
Meas. Tech.ChEMBL_741489 (CHEMBL1763804)
IC50 58±n/a nM
Citation Trotter, BWNanda, KKBurgey, CSPotteiger, CMDeng, JZGreen, AIHartnett, JCKett, NRWu, ZHenze, DADella Penna, KDesai, RLeitl, MDLemaire, WWhite, RBYeh, SUrban, MOKane, SAHartman, GDBilodeau, MT Imidazopyridine CB2 agonists: optimization of CB2/CB1 selectivity and implications for in vivo analgesic efficacy. Bioorg Med Chem Lett21:2354-8 (2011) 
 
Cannabinoid receptor 2
Name:Cannabinoid receptor 2
Type:Enzyme
Mol. Mass.:39366.68
Organism:Rattus norvegicus (Rat)
Description:Q9QZN9
Residue:360
BDBM50340319
NameBDBM50340319
Synonyms:CHEMBL1760939 | N-((1-(hydroxymethyl)cyclopentyl)methyl)-3-morpholinoimidazo[1,5-a]pyridine-1-carboxamide
TypeSmall organic molecule
Emp. Form.C19H26N4O3
Mol. Mass.358.4347
SMILESOCC1(CNC(=O)c2nc(N3CCOCC3)n3ccccc23)CCCC1