Reaction Details
TargetMelatonin receptor type 1A
LigandBDBM50340327
Substrate/Competitorn/a
Meas. Tech.ChEMBL_741504 (CHEMBL1763819)
Ki 9±n/a nM
Citation Jeanty, MSuzenet, FDelagrange, PNosjean, OBoutin, JACaignard, DHGuillaumet, G Design and synthesis of 1-(2-alkanamidoethyl)-6-methoxy-7-azaindole derivatives as potent melatonin agonists. Bioorg Med Chem Lett21:2316-9 (2011) 
 
Melatonin receptor type 1A
Name:Melatonin receptor type 1A
Type:Enzyme
Mol. Mass.:39392.94
Organism:Homo sapiens (Human)
Description:P48039
Residue:350
BDBM50340327
NameBDBM50340327
Synonyms:CHEMBL1760957 | N-(2-(5,6,7,8-Tetrahydro-2-methoxypyrido[2,3-b]indol-9-yl)ethyl)acetamide
TypeSmall organic molecule
Emp. Form.C16H21N3O2
Mol. Mass.287.3568
SMILESCOc1ccc2c3CCCCc3n(CCNC(C)=O)c2n1