Reaction Details
TargetMelatonin receptor type 1A
LigandBDBM50340326
Substrate/Competitorn/a
Meas. Tech.ChEMBL_741504 (CHEMBL1763819)
Ki 16±n/a nM
Citation Jeanty, MSuzenet, FDelagrange, PNosjean, OBoutin, JACaignard, DHGuillaumet, G Design and synthesis of 1-(2-alkanamidoethyl)-6-methoxy-7-azaindole derivatives as potent melatonin agonists. Bioorg Med Chem Lett21:2316-9 (2011) 
 
Melatonin receptor type 1A
Name:Melatonin receptor type 1A
Type:Enzyme
Mol. Mass.:39392.94
Organism:Homo sapiens (Human)
Description:P48039
Residue:350
BDBM50340326
NameBDBM50340326
Synonyms:CHEMBL1760956 | N-(2-(3-iodo-6-methoxy-1H-pyrrolo[2,3-b]pyridin-1-yl)ethyl)acetamide
TypeSmall organic molecule
Emp. Form.C12H14IN3O2
Mol. Mass.359.1629
SMILESCOc1ccc2c(I)cn(CCNC(C)=O)c2n1