Reaction Details
TargetMelatonin receptor type 1B
LigandBDBM50340334
Substrate/Competitorn/a
Meas. Tech.ChEMBL_741505 (CHEMBL1763820)
Ki 1090±n/a nM
Citation Jeanty, MSuzenet, FDelagrange, PNosjean, OBoutin, JACaignard, DHGuillaumet, G Design and synthesis of 1-(2-alkanamidoethyl)-6-methoxy-7-azaindole derivatives as potent melatonin agonists. Bioorg Med Chem Lett21:2316-9 (2011) 
 
Melatonin receptor type 1B
Name:Melatonin receptor type 1B
Type:Enzyme
Mol. Mass.:40203.54
Organism:Homo sapiens (Human)
Description:P49286
Residue:362
BDBM50340334
NameBDBM50340334
Synonyms:CHEMBL1760954 | N-(2-(6-methoxy-3-((methylamino)methyl)-1H-pyrrolo[2,3-b]pyridin-1-yl)ethyl)acetamide
TypeSmall organic molecule
Emp. Form.C14H20N4O2
Mol. Mass.276.3342
SMILESCNCc1cn(CCNC(C)=O)c2nc(OC)ccc12