Reaction Details
TargetMelatonin receptor type 1B
LigandBDBM50340329
Substrate/Competitorn/a
Meas. Tech.ChEMBL_741505 (CHEMBL1763820)
Ki 0.3±n/a nM
Citation Jeanty, MSuzenet, FDelagrange, PNosjean, OBoutin, JACaignard, DHGuillaumet, G Design and synthesis of 1-(2-alkanamidoethyl)-6-methoxy-7-azaindole derivatives as potent melatonin agonists. Bioorg Med Chem Lett21:2316-9 (2011) 
 
Melatonin receptor type 1B
Name:Melatonin receptor type 1B
Type:Enzyme
Mol. Mass.:40203.54
Organism:Homo sapiens (Human)
Description:P49286
Residue:362
BDBM50340329
NameBDBM50340329
Synonyms:4-azamelatonin | CHEMBL1760944
TypeSmall organic molecule
Emp. Form.C12H15N3O2
Mol. Mass.233.2664
SMILESCOc1ccc2[nH]cc(CCNC(C)=O)c2n1