Reaction Details
Target11-beta-hydroxysteroid dehydrogenase type 2
LigandBDBM50340378
Substrate/Competitorn/a
Meas. Tech.ChEMBL_740938 (CHEMBL1764082)
IC50>4000±n/a nM
Citation Maletic, MLeeman, ASzymonifka, MMundt, SSZokian, HJShah, KDragovic, JLyons, KThieringer, RVosatka, AHBalkovec, JWaddell, ST Bicyclo[2.2.2]octyltriazole inhibitors of 11β-hydoxysteroid dehydrogenase type 1. Pharmacological agents for the treatment of metabolic syndrome. Bioorg Med Chem Lett21:2568-72 (2011) 
 
11-beta-hydroxysteroid dehydrogenase type 2
Name:11-beta-hydroxysteroid dehydrogenase type 2
Type:Enzyme
Mol. Mass.:42201.46
Organism:Mus musculus (mouse)
Description:Purified recombinant mouse 11beta-HSD2.
Residue:386
BDBM50340378
NameBDBM50340378
Synonyms:3-(4-(2-(ethylsulfonyl)ethyl)bicyclo[2.2.2]octan-1-yl)-4-methyl-5-(2-(trifluoromethyl)phenyl)-4H-1,2,4-triazole | CHEMBL1761313
TypeSmall organic molecule
Emp. Form.C22H28F3N3O2S
Mol. Mass.455.537
SMILESCCS(=O)(=O)CCC12CCC(CC1)(CC2)c1nnc(-c2ccccc2C(F)(F)F)n1C