Reaction Details
Target11-beta-hydroxysteroid dehydrogenase 1
LigandBDBM50340373
Substrate/Competitorn/a
Meas. Tech.ChEMBL_740937 (CHEMBL1764081)
IC50 1.6±n/a nM
Citation Maletic, MLeeman, ASzymonifka, MMundt, SSZokian, HJShah, KDragovic, JLyons, KThieringer, RVosatka, AHBalkovec, JWaddell, ST Bicyclo[2.2.2]octyltriazole inhibitors of 11β-hydoxysteroid dehydrogenase type 1. Pharmacological agents for the treatment of metabolic syndrome. Bioorg Med Chem Lett21:2568-72 (2011) 
 
11-beta-hydroxysteroid dehydrogenase 1
Name:11-beta-hydroxysteroid dehydrogenase 1
Type:Enzyme
Mol. Mass.:32369.70
Organism:Mus musculus (mouse)
Description:P50172
Residue:292
BDBM50340373
NameBDBM50340373
Synonyms:4-methyl-3-(4-(2-(phenylsulfonyl)ethyl)bicyclo[2.2.2]octan-1-yl)-5-(2-(trifluoromethyl)phenyl)-4H-1,2,4-triazole | CHEMBL1761318
TypeSmall organic molecule
Emp. Form.C26H28F3N3O2S
Mol. Mass.503.58
SMILESCn1c(nnc1C12CCC(CCS(=O)(=O)c3ccccc3)(CC1)CC2)-c1ccccc1C(F)(F)F