Reaction Details
Target11-beta-hydroxysteroid dehydrogenase 1
LigandBDBM50340399
Substrate/Competitorn/a
Meas. Tech.ChEMBL_740937 (CHEMBL1764081)
IC50 2±n/a nM
Citation Maletic, MLeeman, ASzymonifka, MMundt, SSZokian, HJShah, KDragovic, JLyons, KThieringer, RVosatka, AHBalkovec, JWaddell, ST Bicyclo[2.2.2]octyltriazole inhibitors of 11β-hydoxysteroid dehydrogenase type 1. Pharmacological agents for the treatment of metabolic syndrome. Bioorg Med Chem Lett21:2568-72 (2011) 
 
11-beta-hydroxysteroid dehydrogenase 1
Name:11-beta-hydroxysteroid dehydrogenase 1
Type:Enzyme
Mol. Mass.:32369.70
Organism:Mus musculus (mouse)
Description:P50172
Residue:292
BDBM50340399
NameBDBM50340399
Synonyms:4-methyl-3-(4-((4-(methylsulfonyl)phenoxy)methyl)bicyclo[2.2.2]octan-1-yl)-5-(2-(trifluoromethyl)phenyl)-4H-1,2,4-triazole | CHEMBL1761143
TypeSmall organic molecule
Emp. Form.C26H28F3N3O3S
Mol. Mass.519.579
SMILESCn1c(nnc1C12CCC(COc3ccc(cc3)S(C)(=O)=O)(CC1)CC2)-c1ccccc1C(F)(F)F