Reaction Details
Target11-beta-hydroxysteroid dehydrogenase 1
LigandBDBM50340372
Substrate/Competitorn/a
Meas. Tech.ChEMBL_740937 (CHEMBL1764081)
IC50 3.6±n/a nM
Citation Maletic, MLeeman, ASzymonifka, MMundt, SSZokian, HJShah, KDragovic, JLyons, KThieringer, RVosatka, AHBalkovec, JWaddell, ST Bicyclo[2.2.2]octyltriazole inhibitors of 11β-hydoxysteroid dehydrogenase type 1. Pharmacological agents for the treatment of metabolic syndrome. Bioorg Med Chem Lett21:2568-72 (2011) 
 
11-beta-hydroxysteroid dehydrogenase 1
Name:11-beta-hydroxysteroid dehydrogenase 1
Type:Enzyme
Mol. Mass.:32369.70
Organism:Mus musculus (mouse)
Description:P50172
Residue:292
BDBM50340372
NameBDBM50340372
Synonyms:3-(4-(2-(isopropylsulfonyl)ethyl)bicyclo[2.2.2]octan-1-yl)-4-methyl-5-(2-(trifluoromethyl)phenyl)-4H-1,2,4-triazole | CHEMBL1761316
TypeSmall organic molecule
Emp. Form.C23H30F3N3O2S
Mol. Mass.469.563
SMILESCC(C)S(=O)(=O)CCC12CCC(CC1)(CC2)c1nnc(-c2ccccc2C(F)(F)F)n1C