Reaction Details
Target11-beta-hydroxysteroid dehydrogenase 1
LigandBDBM50340392
Substrate/Competitorn/a
Meas. Tech.ChEMBL_740939 (CHEMBL1764083)
IC50 3.7±n/a nM
Citation Maletic, MLeeman, ASzymonifka, MMundt, SSZokian, HJShah, KDragovic, JLyons, KThieringer, RVosatka, AHBalkovec, JWaddell, ST Bicyclo[2.2.2]octyltriazole inhibitors of 11β-hydoxysteroid dehydrogenase type 1. Pharmacological agents for the treatment of metabolic syndrome. Bioorg Med Chem Lett21:2568-72 (2011) 
 
11-beta-hydroxysteroid dehydrogenase 1
Name:11-beta-hydroxysteroid dehydrogenase 1
Type:Enzyme
Mol. Mass.:32409.16
Organism:Homo sapiens (Human)
Description:P28845
Residue:292
BDBM50340392
NameBDBM50340392
Synonyms:4-methyl-3-(4-(2-(2,2,2-trifluoroethylsulfonyl)ethyl)bicyclo[2.2.2]octan-1-yl)-5-(2-(trifluoromethyl)phenyl)-4H-1,2,4-triazole | CHEMBL1761320
TypeSmall organic molecule
Emp. Form.C22H25F6N3O2S
Mol. Mass.509.508
SMILESCn1c(nnc1C12CCC(CCS(=O)(=O)CC(F)(F)F)(CC1)CC2)-c1ccccc1C(F)(F)F