Reaction Details
TargetBotulinum neurotoxin type A
LigandBDBM50340405
Substrate/Competitorn/a
Meas. Tech.ChEMBL_741005 (CHEMBL1764191)
Ki 13300±n/a nM
Citation Šilhár, PAlakurtti, SCapková, KXiaochuan, FShoemaker, CBYli-Kauhaluoma, JJanda, KD Synthesis and evaluation of library of betulin derivatives against the botulinum neurotoxin A protease. Bioorg Med Chem Lett21:2229-31 (2011) 
 
Botulinum neurotoxin type A
Name:Botulinum neurotoxin type A
Type:PROTEIN
Mol. Mass.:149450.01
Organism:Clostridium botulinum
Description:ChEMBL_1510137
Residue:1296
BDBM50340405
NameBDBM50340405
Synonyms:Betulinyl 28-carboxymethoxycarvacrolate | CHEMBL1076486
TypeSmall organic molecule
Emp. Form.C42H64O4
Mol. Mass.632.9552
SMILESCC(C)c1ccc(C)c(OCC(=O)OC[C@]23CC[C@H]([C@@H]2[C@H]2CC[C@@H]4[C@@]5(C)CC[C@H](O)C(C)(C)[C@@H]5CC[C@@]4(C)[C@]2(C)CC3)C(C)=C)c1