Reaction Details
TargetRenin
LigandBDBM50340413
Substrate/Competitorn/a
Meas. Tech.ChEMBL_741046 (CHEMBL1764274)
pH7.4±n/a
IC50 0.027±n/a nM
Commentsextracted
Citation Aspiotis, RChen, ACauchon, EDubé, DFalgueyret, JPGagné, SGallant, MGrimm, ELHoule, RJuteau, HLacombe, PLaliberté, SLévesque, JFMacDonald, DMcKay, DPercival, MDRoy, PSoisson, SMWu, T The discovery and synthesis of potent zwitterionic inhibitors of renin. Bioorg Med Chem Lett21:2430-6 (2011) 
 
Renin
Name:Renin
Type:Enzyme
Mol. Mass.:45058.99
Organism:Homo sapiens (Human)
Description:n/a
Residue:406
BDBM50340413
NameBDBM50340413
Synonyms:(1S,2S)-2-((3-(((3R,4S)-N-cyclopropyl-4-(4-(2-(2,6-dichloro-4-methylphenoxy)ethoxy)phenyl)piperidine-3-carboxamido)methyl)-5-(3-methoxypropyl)phenoxy)methyl)cyclopropanecarboxylic acid | CHEMBL1761525
TypeSmall organic molecule
Emp. Form.C40H48Cl2N2O7
Mol. Mass.739.724
SMILESCOCCCc1cc(CN(C2CC2)C(=O)[C@H]2CNCC[C@@H]2c2ccc(OCCOc3c(Cl)cc(C)cc3Cl)cc2)cc(OC[C@H]2C[C@@H]2C(O)=O)c1