Reaction Details
TargetRenin
LigandBDBM50340408
Substrate/Competitorn/a
Meas. Tech.ChEMBL_741040 (CHEMBL1764268)
IC50 4.5±n/a nM
Citation Aspiotis, RChen, ACauchon, EDubé, DFalgueyret, JPGagné, SGallant, MGrimm, ELHoule, RJuteau, HLacombe, PLaliberté, SLévesque, JFMacDonald, DMcKay, DPercival, MDRoy, PSoisson, SMWu, T The discovery and synthesis of potent zwitterionic inhibitors of renin. Bioorg Med Chem Lett21:2430-6 (2011) 
 
Renin
Name:Renin
Type:Enzyme
Mol. Mass.:45058.99
Organism:Homo sapiens (Human)
Description:n/a
Residue:406
BDBM50340408
NameBDBM50340408
Synonyms:(3R,4S)-N-cyclopropyl-4-(4-(2-(2,6-dichloro-4-methylphenoxy)ethoxy)phenyl)-N-(3-(2-(dimethylamino)ethoxy)-5-(3-methoxypropyl)benzyl)piperidine-3-carboxamide | CHEMBL1761520
TypeSmall organic molecule
Emp. Form.C39H51Cl2N3O5
Mol. Mass.712.745
SMILESCOCCCc1cc(CN(C2CC2)C(=O)[C@H]2CNCC[C@@H]2c2ccc(OCCOc3c(Cl)cc(C)cc3Cl)cc2)cc(OCCN(C)C)c1