Reaction Details
TargetCytochrome P450 3A4
LigandBDBM50340410
Substrate/Competitorn/a
Meas. Tech.ChEMBL_741043 (CHEMBL1764271)
IC50 2400±n/a nM
Citation Aspiotis, RChen, ACauchon, EDubé, DFalgueyret, JPGagné, SGallant, MGrimm, ELHoule, RJuteau, HLacombe, PLaliberté, SLévesque, JFMacDonald, DMcKay, DPercival, MDRoy, PSoisson, SMWu, T The discovery and synthesis of potent zwitterionic inhibitors of renin. Bioorg Med Chem Lett21:2430-6 (2011) 
 
Cytochrome P450 3A4
Name:Cytochrome P450 3A4
Type:Enzyme
Mol. Mass.:57349.57
Organism:Homo sapiens (Human)
Description:n/a
Residue:503
BDBM50340410
NameBDBM50340410
Synonyms:(3R,4S)-N-cyclopropyl-4-(4-(2-(2,6-dichloro-4-methylphenoxy)ethoxy)phenyl)-N-(3-(3-(3-ethylureido)propoxy)-5-(3-methoxypropyl)benzyl)piperidine-3-carboxamide | CHEMBL1761522
TypeSmall organic molecule
Emp. Form.C41H54Cl2N4O6
Mol. Mass.769.797
SMILESCCNC(=O)NCCCOc1cc(CCCOC)cc(CN(C2CC2)C(=O)[C@H]2CNCC[C@@H]2c2ccc(OCCOc3c(Cl)cc(C)cc3Cl)cc2)c1