Reaction Details
Target11-beta-hydroxysteroid dehydrogenase type 2
LigandBDBM50340431
Substrate/Competitorn/a
Meas. Tech.ChEMBL_741136 (CHEMBL1764407)
IC50>10±n/a nM
Citation Venier, OPascal, CBraun, ANamane, CMougenot, PCrespin, OPacquet, FMougenot, CMonseau, COnofri, BDadji-Faïhun, RLeger, CBen-Hassine, MVan-Pham, TRagot, JLPhilippo, CGüssregen, SEngel, CFarjot, GNoah, LManiani, KNicolaï, E Pyrrolidine-pyrazole ureas as potent and selective inhibitors of 11β-hydroxysteroid-dehydrogenase type 1. Bioorg Med Chem Lett21:2244-51 (2011) 
 
11-beta-hydroxysteroid dehydrogenase type 2
Name:11-beta-hydroxysteroid dehydrogenase type 2
Type:Enzyme
Mol. Mass.:44141.72
Organism:Homo sapiens (Human)
Description:Purified recombinant human 11beta-HSD2.
Residue:405
BDBM50340431
NameBDBM50340431
Synonyms:(4-(1H-imidazol-4-yl)piperidin-1-yl)(3,4-dihydroquinolin-1(2H)-yl)methanone | CHEMBL1761844
TypeSmall organic molecule
Emp. Form.C18H22N4O
Mol. Mass.310.3935
SMILESO=C(N1CCC(CC1)c1cnc[nH]1)N1CCCc2ccccc12