Reaction Details
Target3 beta-hydroxysteroid dehydrogenase/Delta 5-->4-isomerase
LigandBDBM50340471
Substrate/Competitorn/a
Meas. Tech.ChEMBL_741233 (CHEMBL1764602)
IC50 500±n/a nM
Citation Thomas, STYang, XSampson, NS Inhibition of the M. tuberculosis 3β-hydroxysteroid dehydrogenase by azasteroids. Bioorg Med Chem Lett21:2216-9 (2011) 
 
3 beta-hydroxysteroid dehydrogenase/Delta 5-->4-isomerase
Name:3 beta-hydroxysteroid dehydrogenase/Delta 5-->4-isomerase
Synonyms:3BHS_MYCTU
Type:PROTEIN
Mol. Mass.:40743.62
Organism:Mycobacterium tuberculosis
Description:ChEMBL_741233
Residue:370
BDBM50340471
NameBDBM50340471
TypeSmall organic molecule
Emp. Form.C26H43NO
Mol. Mass.385.6257
SMILESCC(C)CCC[C@@H](C)[C@H]1CC[C@H]2[C@@H]3CN=C4CC(=O)CC[C@]4(C)[C@H]3CC[C@]12C