Reaction Details
TargetEphrin type-B receptor 4
LigandBDBM50340571
Substrate/Competitorn/a
Meas. Tech.ChEMBL_741347 (CHEMBL1764816)
IC50 4±n/a nM
Citation Barlaam, BDucray, RLambert-van der Brempt, CPlé, PBardelle, CBrooks, NColeman, TCross, DKettle, JGRead, J Inhibitors of the tyrosine kinase EphB4. Part 4: Discovery and optimization of a benzylic alcohol series. Bioorg Med Chem Lett21:2207-11 (2011) 
 
Ephrin type-B receptor 4
Name:Ephrin type-B receptor 4
Type:Enzyme
Mol. Mass.:108273.51
Organism:Homo sapiens (Human)
Description:P54760
Residue:987
BDBM50340571
NameBDBM50340571
Synonyms:(3-((2-(3,5-dimorpholinophenylamino)pyrimidin-4-yl)(methyl)amino)-4-methylphenyl)methanol | CHEMBL1762530
TypeSmall organic molecule
Emp. Form.C27H34N6O3
Mol. Mass.490.5973
SMILESCN(c1ccnc(Nc2cc(cc(c2)N2CCOCC2)N2CCOCC2)n1)c1cc(CO)ccc1C