Reaction Details
TargetEphrin type-B receptor 4
LigandBDBM50340578
Substrate/Competitorn/a
Meas. Tech.ChEMBL_741347 (CHEMBL1764816)
IC50 8±n/a nM
Citation Barlaam, BDucray, RLambert-van der Brempt, CPlé, PBardelle, CBrooks, NColeman, TCross, DKettle, JGRead, J Inhibitors of the tyrosine kinase EphB4. Part 4: Discovery and optimization of a benzylic alcohol series. Bioorg Med Chem Lett21:2207-11 (2011) 
 
Ephrin type-B receptor 4
Name:Ephrin type-B receptor 4
Type:Enzyme
Mol. Mass.:108273.51
Organism:Homo sapiens (Human)
Description:P54760
Residue:987
BDBM50340578
NameBDBM50340578
Synonyms:CHEMBL1762523 | N2-(3,5-dimorpholinophenyl)-N4-methyl-N4-m-tolylpyrimidine-2,4-diamine
TypeSmall organic molecule
Emp. Form.C26H32N6O2
Mol. Mass.460.5713
SMILESCN(c1cccc(C)c1)c1ccnc(Nc2cc(cc(c2)N2CCOCC2)N2CCOCC2)n1