Reaction Details
TargetTranscription factor Jun
LigandBDBM50340606
Substrate/Competitorn/a
Meas. Tech.ChEMBL_739507 (CHEMBL1763333)
IC50 40±n/a nM
Citation He, YKamenecka, TMShin, YSong, XJiang, RNoel, RDuckett, DChen, WLing, YYCameron, MDLin, LKhan, SKoenig, MLoGrasso, PV Synthesis and SAR of novel quinazolines as potent and brain-penetrant c-jun N-terminal kinase (JNK) inhibitors. Bioorg Med Chem Lett21:1719-23 (2011) 
 
Transcription factor Jun
Name:Transcription factor Jun
Type:n/a
Mol. Mass.:35683.24
Organism:Homo sapiens (Human)
Description:P05412
Residue:331
BDBM50340606
NameBDBM50340606
Synonyms:CHEMBL1761561 | N-(4-(3-(6-methylpyridin-3-yl)-1H-1,2,4-triazol-1-yl)phenyl)-7-(1H-pyrazol-4-yl)quinazolin-2-amine
TypeSmall organic molecule
Emp. Form.C25H19N9
Mol. Mass.445.4787
SMILESCc1ccc(cn1)-c1ncn(n1)-c1ccc(Nc2ncc3ccc(cc3n2)-c2cn[nH]c2)cc1