Reaction Details
TargetTranscription factor Jun
LigandBDBM50340607
Substrate/Competitorn/a
Meas. Tech.ChEMBL_739507 (CHEMBL1763333)
IC50 290±n/a nM
Citation He, YKamenecka, TMShin, YSong, XJiang, RNoel, RDuckett, DChen, WLing, YYCameron, MDLin, LKhan, SKoenig, MLoGrasso, PV Synthesis and SAR of novel quinazolines as potent and brain-penetrant c-jun N-terminal kinase (JNK) inhibitors. Bioorg Med Chem Lett21:1719-23 (2011) 
 
Transcription factor Jun
Name:Transcription factor Jun
Type:n/a
Mol. Mass.:35683.24
Organism:Homo sapiens (Human)
Description:P05412
Residue:331
BDBM50340607
NameBDBM50340607
Synonyms:7-(1-methyl-1H-pyrazol-4-yl)-N-(4-(3-(pyridin-2-yl)-1H-1,2,4-triazol-1-yl)phenyl)quinazolin-2-amine | CHEMBL1761562
TypeSmall organic molecule
Emp. Form.C25H19N9
Mol. Mass.445.4787
SMILESCn1cc(cn1)-c1ccc2cnc(Nc3ccc(cc3)-n3cnc(n3)-c3ccccn3)nc2c1