Reaction Details
TargetTranscription factor Jun
LigandBDBM50340613
Substrate/Competitorn/a
Meas. Tech.ChEMBL_739507 (CHEMBL1763333)
IC50 500±n/a nM
Citation He, YKamenecka, TMShin, YSong, XJiang, RNoel, RDuckett, DChen, WLing, YYCameron, MDLin, LKhan, SKoenig, MLoGrasso, PV Synthesis and SAR of novel quinazolines as potent and brain-penetrant c-jun N-terminal kinase (JNK) inhibitors. Bioorg Med Chem Lett21:1719-23 (2011) 
 
Transcription factor Jun
Name:Transcription factor Jun
Type:n/a
Mol. Mass.:35683.24
Organism:Homo sapiens (Human)
Description:P05412
Residue:331
BDBM50340613
NameBDBM50340613
Synonyms:8-(3-fluoro-4-methoxyphenyl)-N-(4-(3-methyl-1H-1,2,4-triazol-1-yl)phenyl)quinazolin-2-amine | CHEMBL1761568
TypeSmall organic molecule
Emp. Form.C24H19FN6O
Mol. Mass.426.4457
SMILESCOc1ccc(cc1F)-c1cccc2cnc(Nc3ccc(cc3)-n3cnc(C)n3)nc12