Reaction Details
TargetTranscription factor Jun
LigandBDBM50340628
Substrate/Competitorn/a
Meas. Tech.ChEMBL_739507 (CHEMBL1763333)
IC50 40±n/a nM
Citation He, YKamenecka, TMShin, YSong, XJiang, RNoel, RDuckett, DChen, WLing, YYCameron, MDLin, LKhan, SKoenig, MLoGrasso, PV Synthesis and SAR of novel quinazolines as potent and brain-penetrant c-jun N-terminal kinase (JNK) inhibitors. Bioorg Med Chem Lett21:1719-23 (2011) 
 
Transcription factor Jun
Name:Transcription factor Jun
Type:n/a
Mol. Mass.:35683.24
Organism:Homo sapiens (Human)
Description:P05412
Residue:331
BDBM50340628
NameBDBM50340628
Synonyms:7-(1-methyl-1H-pyrazol-4-yl)-N-(4-(3-morpholino-1H-1,2,4-triazol-1-yl)phenyl)-8-phenylquinazolin-2-amine | CHEMBL1761583
TypeSmall organic molecule
Emp. Form.C30H27N9O
Mol. Mass.529.5951
SMILESCn1cc(cn1)-c1ccc2cnc(Nc3ccc(cc3)-n3cnc(n3)N3CCOCC3)nc2c1-c1ccccc1