Reaction Details
TargetNociceptin receptor
LigandBDBM50340682
Substrate/Competitorn/a
Meas. Tech.ChEMBL_740151 (CHEMBL1763211)
IC50 152.9±n/a nM
Citation Del Giudice, MRBorioni, ABastanzio, GSbraccia, MMustazza, CSestili, I Synthesis and pharmacological evaluation of bivalent antagonists of the nociceptin opioid receptor. Eur J Med Chem46:1207-21 (2011) 
 
Nociceptin receptor
Name:Nociceptin receptor
Type:G Protein-Coupled Receptor (GPCR)
Mol. Mass.:40702.87
Organism:Homo sapiens (Human)
Description:P41146
Residue:370
BDBM50340682
NameBDBM50340682
Synonyms:CHEMBL1762411 | N-(4-amino-2-methylquinolin-6-yl)-2-[4-(10-aminodecylaminomethyl)phenoxymethyl]benzamide
TypeSmall organic molecule
Emp. Form.C35H45N5O2
Mol. Mass.567.7641
SMILESCc1cc(N)c2cc(NC(=O)c3ccccc3COc3ccc(CNCCCCCCCCCCN)cc3)ccc2n1