Reaction Details
TargetKappa-type opioid receptor
LigandBDBM50340705
Substrate/Competitorn/a
Meas. Tech.ChEMBL_740153 (CHEMBL1763213)
IC50 998±n/a nM
Citation Del Giudice, MRBorioni, ABastanzio, GSbraccia, MMustazza, CSestili, I Synthesis and pharmacological evaluation of bivalent antagonists of the nociceptin opioid receptor. Eur J Med Chem46:1207-21 (2011) 
 
Kappa-type opioid receptor
Name:Kappa-type opioid receptor
Type:G Protein-Coupled Receptor (GPCR)
Mol. Mass.:42648.76
Organism:Homo sapiens (Human)
Description:P41145
Residue:380
BDBM50340705
NameBDBM50340705
Synonyms:CHEMBL1762408 | N-(4-amino-2-methylquinolin-6-yl)-2-[4-(7-aminoheptylaminomethyl)phenoxymethyl]benzamide
TypeSmall organic molecule
Emp. Form.C32H39N5O2
Mol. Mass.525.6844
SMILESCc1cc(N)c2cc(NC(=O)c3ccccc3COc3ccc(CNCCCCCCCN)cc3)ccc2n1