Reaction Details
TargetNociceptin receptor
LigandBDBM50340701
Substrate/Competitorn/a
Meas. Tech.ChEMBL_740151 (CHEMBL1763211)
IC50 159.6±n/a nM
Citation Del Giudice, MRBorioni, ABastanzio, GSbraccia, MMustazza, CSestili, I Synthesis and pharmacological evaluation of bivalent antagonists of the nociceptin opioid receptor. Eur J Med Chem46:1207-21 (2011) 
 
Nociceptin receptor
Name:Nociceptin receptor
Type:G Protein-Coupled Receptor (GPCR)
Mol. Mass.:40702.87
Organism:Homo sapiens (Human)
Description:P41146
Residue:370
BDBM50340701
NameBDBM50340701
Synonyms:CHEMBL1762405 | N-(4-amino-2-methylquinolin-6-yl)-2-[4-(3-aminopropylaminomethyl)phenoxymethyl]benzamide
TypeSmall organic molecule
Emp. Form.C28H31N5O2
Mol. Mass.469.578
SMILESCc1cc(N)c2cc(NC(=O)c3ccccc3COc3ccc(CNCCCN)cc3)ccc2n1