Reaction Details
TargetMu-type opioid receptor
LigandBDBM50340700
Substrate/Competitorn/a
Meas. Tech.ChEMBL_740229 (CHEMBL1764074)
IC50 2755±n/a nM
Citation Del Giudice, MRBorioni, ABastanzio, GSbraccia, MMustazza, CSestili, I Synthesis and pharmacological evaluation of bivalent antagonists of the nociceptin opioid receptor. Eur J Med Chem46:1207-21 (2011) 
 
Mu-type opioid receptor
Name:Mu-type opioid receptor
Type:G Protein-Coupled Receptor (GPCR)
Mol. Mass.:44789.51
Organism:Homo sapiens (Human)
Description:P35372
Residue:400
BDBM50340700
NameBDBM50340700
Synonyms:CHEMBL1762404 | N-(4-amino-2-methylquinolin-6-yl)-2-[4-(decylaminomethyl)phenoxymethyl]benzamide
TypeSmall organic molecule
Emp. Form.C35H44N4O2
Mol. Mass.552.7495
SMILESCCCCCCCCCCNCc1ccc(OCc2ccccc2C(=O)Nc2ccc3nc(C)cc(N)c3c2)cc1