Reaction Details
TargetNociceptin receptor
LigandBDBM50340714
Substrate/Competitorn/a
Meas. Tech.ChEMBL_740151 (CHEMBL1763211)
IC50 113.6±n/a nM
Citation Del Giudice, MRBorioni, ABastanzio, GSbraccia, MMustazza, CSestili, I Synthesis and pharmacological evaluation of bivalent antagonists of the nociceptin opioid receptor. Eur J Med Chem46:1207-21 (2011) 
 
Nociceptin receptor
Name:Nociceptin receptor
Type:G Protein-Coupled Receptor (GPCR)
Mol. Mass.:40702.87
Organism:Homo sapiens (Human)
Description:P41146
Residue:370
BDBM50340714
NameBDBM50340714
Synonyms:(E,E)-N,N'-bis[[4-[[2-[[(4-amino-2-methylquinolin-6-yl)amino]carbonyl]phenyl]methoxy]phenyl]methylene]-1,8-octanediamine | CHEMBL1762378
TypeSmall organic molecule
Emp. Form.C58H58N8O4
Mol. Mass.931.1323
SMILESCc1cc(N)c2cc(NC(=O)c3ccccc3COc3ccc(\C=N\CCCCCCCC\N=C\c4ccc(OCc5ccccc5C(=O)Nc5ccc6nc(C)cc(N)c6c5)cc4)cc3)ccc2n1