Reaction Details
TargetNociceptin receptor
LigandBDBM50340724
Substrate/Competitorn/a
Meas. Tech.ChEMBL_740151 (CHEMBL1763211)
IC50 184.5±n/a nM
Citation Del Giudice, MRBorioni, ABastanzio, GSbraccia, MMustazza, CSestili, I Synthesis and pharmacological evaluation of bivalent antagonists of the nociceptin opioid receptor. Eur J Med Chem46:1207-21 (2011) 
 
Nociceptin receptor
Name:Nociceptin receptor
Type:G Protein-Coupled Receptor (GPCR)
Mol. Mass.:40702.87
Organism:Homo sapiens (Human)
Description:P41146
Residue:370
BDBM50340724
NameBDBM50340724
Synonyms:(E)-N-(4-amino-2-methylquinolin-6-yl)-2-[4-(decyliminomethyl)phenoxymethyl]benzamide | CHEMBL1762396
TypeSmall organic molecule
Emp. Form.C35H42N4O2
Mol. Mass.550.7336
SMILESCCCCCCCCCC\N=C\c1ccc(OCc2ccccc2C(=O)Nc2ccc3nc(C)cc(N)c3c2)cc1