Reaction Details
Target5-hydroxytryptamine receptor 6
LigandBDBM50340726
Substrate/Competitorn/a
Meas. Tech.ChEMBL_740242 (CHEMBL1764142)
Ki 1.2±n/a nM
Citation Ivachtchenko, AVGolovina, ESKadieva, MGKoryakova, AGMitkin, ODTkachenko, SEKysil, VMOkun, I 2-Substituted 5,6-dimethyl-3-phenylsulfonyl-pyrazolo[1,5-a]pyrimidines: new series of highly potent and specific serotonin 5-HT6 receptor antagonists. Eur J Med Chem46:1189-97 (2011) 
 
5-hydroxytryptamine receptor 6
Name:5-hydroxytryptamine receptor 6
Type:G Protein-Coupled Receptor (GPCR)
Mol. Mass.:46968.43
Organism:Homo sapiens (Human)
Description:P50406
Residue:440
BDBM50340726
NameBDBM50340726
Synonyms:5,7-dimethyl-2-(methylthio)-3-(phenylsulfonyl)pyrazolo[1,5-a]pyrimidine US8552005, 1.1(5)
TypeSmall organic molecule
Emp. Form.C15H15N3O2S2
Mol. Mass.333.429
SMILESCSc1nn2c(C)cc(C)nc2c1S(=O)(=O)c1ccccc1