Reaction Details
TargetMas-related G-protein coupled receptor member X1
LigandBDBM50340741
Substrate/Competitorn/a
Meas. Tech.ChEMBL_740644 (CHEMBL1763646)
IC50 301±n/a nM
Citation Bayrakdarian, MButterworth, JHu, YJSanthakumar, VTomaszewski, MJ Development of 2,4-diaminopyrimidine derivatives as novel SNSR4 antagonists. Bioorg Med Chem Lett21:2102-5 (2011) 
 
Mas-related G-protein coupled receptor member X1
Name:Mas-related G-protein coupled receptor member X1
Type:PROTEIN
Mol. Mass.:36253.68
Organism:Homo sapiens (Human)
Description:ChEMBL_516621
Residue:322
BDBM50340741
NameBDBM50340741
Synonyms:4-(2-(2-(4-chlorophenethylamino)pyrimidin-4-ylamino)ethyl)benzenesulfonamide | CHEMBL1762696
TypeSmall organic molecule
Emp. Form.C20H22ClN5O2S
Mol. Mass.431.939
SMILESNS(=O)(=O)c1ccc(CCNc2ccnc(NCCc3ccc(Cl)cc3)n2)cc1