Reaction Details
TargetMas-related G-protein coupled receptor member X1
LigandBDBM50340751
Substrate/Competitorn/a
Meas. Tech.ChEMBL_740644 (CHEMBL1763646)
IC50 108±n/a nM
Citation Bayrakdarian, MButterworth, JHu, YJSanthakumar, VTomaszewski, MJ Development of 2,4-diaminopyrimidine derivatives as novel SNSR4 antagonists. Bioorg Med Chem Lett21:2102-5 (2011) 
 
Mas-related G-protein coupled receptor member X1
Name:Mas-related G-protein coupled receptor member X1
Type:PROTEIN
Mol. Mass.:36253.68
Organism:Homo sapiens (Human)
Description:ChEMBL_516621
Residue:322
BDBM50340751
NameBDBM50340751
Synonyms:CHEMBL1762705 | N-((3-bromopyridin-4-yl)methyl)-2-(4-(2-(4-chlorophenethylamino)pyrimidin-4-yl)piperazin-1-yl)-N-ethylacetamide
TypeSmall organic molecule
Emp. Form.C26H31BrClN7O
Mol. Mass.572.928
SMILESCCN(Cc1ccncc1Br)C(=O)CN1CCN(CC1)c1ccnc(NCCc2ccc(Cl)cc2)n1