Reaction Details
TargetLethal factor
LigandBDBM50340754
Substrate/Competitorn/a
Meas. Tech.ChEMBL_740261 (CHEMBL1764161)
Ki 0.13±n/a nM
Citation Kim, SJiao, GSMoayeri, MCrown, DCregar-Hernandez, LMcKasson, LMargosiak, SALeppla, SHJohnson, AT Antidotes to anthrax lethal factor intoxication. Part 2: structural modifications leading to improved in vivo efficacy. Bioorg Med Chem Lett21:2030-3 (2011) 
 
Lethal factor
Name:Lethal factor
Type:PROTEIN
Mol. Mass.:93758.56
Organism:Bacillus anthracis
Description:ChEMBL_1460338
Residue:809
BDBM50340754
NameBDBM50340754
Synonyms:(S)-2-(4-fluoro-3,5-dimethylbenzyl)-6-(4-fluorobenzylamino)-N-hydroxyhexanamide | CHEMBL1760324
TypeSmall organic molecule
Emp. Form.C22H28F2N2O2
Mol. Mass.390.4667
SMILESCc1cc(C[C@H](CCCCNCc2ccc(F)cc2)C(=O)NO)cc(C)c1F