Reaction Details
TargetLethal factor
LigandBDBM50340759
Substrate/Competitorn/a
Meas. Tech.ChEMBL_740261 (CHEMBL1764161)
Ki 0.62±n/a nM
Citation Kim, SJiao, GSMoayeri, MCrown, DCregar-Hernandez, LMcKasson, LMargosiak, SALeppla, SHJohnson, AT Antidotes to anthrax lethal factor intoxication. Part 2: structural modifications leading to improved in vivo efficacy. Bioorg Med Chem Lett21:2030-3 (2011) 
 
Lethal factor
Name:Lethal factor
Type:PROTEIN
Mol. Mass.:93758.56
Organism:Bacillus anthracis
Description:ChEMBL_1460338
Residue:809
BDBM50340759
NameBDBM50340759
Synonyms:(R)-6-(4-fluoro-3-methylbenzylamino)-2-(4-fluoro-3-methylphenylamino)-N-hydroxyhexanamide | CHEMBL1760326
TypeSmall organic molecule
Emp. Form.C21H27F2N3O2
Mol. Mass.391.4548
SMILESCc1cc(CNCCCC[C@@H](Nc2ccc(F)c(C)c2)C(=O)NO)ccc1F