Reaction Details
TargetLethal factor
LigandBDBM50340762
Substrate/Competitorn/a
Meas. Tech.ChEMBL_740261 (CHEMBL1764161)
Ki 0.75±n/a nM
Citation Kim, SJiao, GSMoayeri, MCrown, DCregar-Hernandez, LMcKasson, LMargosiak, SALeppla, SHJohnson, AT Antidotes to anthrax lethal factor intoxication. Part 2: structural modifications leading to improved in vivo efficacy. Bioorg Med Chem Lett21:2030-3 (2011) 
 
Lethal factor
Name:Lethal factor
Type:PROTEIN
Mol. Mass.:93758.56
Organism:Bacillus anthracis
Description:ChEMBL_1460338
Residue:809
BDBM50340762
NameBDBM50340762
Synonyms:(R)-6-(4-chlorobenzylamino)-2-(4-fluoro-3-methylphenoxy)-N-hydroxyhexanamide | CHEMBL1760448
TypeSmall organic molecule
Emp. Form.C20H24ClFN2O3
Mol. Mass.394.868
SMILESCc1cc(O[C@H](CCCCNCc2ccc(Cl)cc2)C(=O)NO)ccc1F