Reaction Details
TargetLethal factor
LigandBDBM50329266
Substrate/Competitorn/a
Meas. Tech.ChEMBL_740261 (CHEMBL1764161)
Ki 1±n/a nM
Citation Kim, SJiao, GSMoayeri, MCrown, DCregar-Hernandez, LMcKasson, LMargosiak, SALeppla, SHJohnson, AT Antidotes to anthrax lethal factor intoxication. Part 2: structural modifications leading to improved in vivo efficacy. Bioorg Med Chem Lett21:2030-3 (2011) 
 
Lethal factor
Name:Lethal factor
Type:PROTEIN
Mol. Mass.:93758.56
Organism:Bacillus anthracis
Description:ChEMBL_1460338
Residue:809
BDBM50329266
NameBDBM50329266
Synonyms:(R)-6-(4-chlorobenzylamino)-2-(4-fluoro-3,5-dimethylphenylamino)-N-hydroxyhexanamide | CHEMBL1270102
TypeSmall organic molecule
Emp. Form.C21H27ClFN3O2
Mol. Mass.407.909
SMILESCc1cc(N[C@H](CCCCNCc2ccc(Cl)cc2)C(=O)NO)cc(C)c1F