Reaction Details
TargetLethal factor
LigandBDBM50340766
Substrate/Competitorn/a
Meas. Tech.ChEMBL_740261 (CHEMBL1764161)
Ki 1.1±n/a nM
Citation Kim, SJiao, GSMoayeri, MCrown, DCregar-Hernandez, LMcKasson, LMargosiak, SALeppla, SHJohnson, AT Antidotes to anthrax lethal factor intoxication. Part 2: structural modifications leading to improved in vivo efficacy. Bioorg Med Chem Lett21:2030-3 (2011) 
 
Lethal factor
Name:Lethal factor
Type:PROTEIN
Mol. Mass.:93758.56
Organism:Bacillus anthracis
Description:ChEMBL_1460338
Residue:809
BDBM50340766
NameBDBM50340766
Synonyms:(R)-2-(4-fluoro-3-methylphenoxy)-6-(4-fluorobenzylamino)-N-hydroxyhexanamide | CHEMBL1760447
TypeSmall organic molecule
Emp. Form.C20H24F2N2O3
Mol. Mass.378.413
SMILESCc1cc(O[C@H](CCCCNCc2ccc(F)cc2)C(=O)NO)ccc1F