Reaction Details
TargetLethal factor
LigandBDBM50340775
Substrate/Competitorn/a
Meas. Tech.ChEMBL_740261 (CHEMBL1764161)
Ki 4.6±n/a nM
Citation Kim, SJiao, GSMoayeri, MCrown, DCregar-Hernandez, LMcKasson, LMargosiak, SALeppla, SHJohnson, AT Antidotes to anthrax lethal factor intoxication. Part 2: structural modifications leading to improved in vivo efficacy. Bioorg Med Chem Lett21:2030-3 (2011) 
 
Lethal factor
Name:Lethal factor
Type:PROTEIN
Mol. Mass.:93758.56
Organism:Bacillus anthracis
Description:ChEMBL_1460338
Residue:809
BDBM50340775
NameBDBM50340775
Synonyms:(R)-2-(4-fluoro-3,5-dimethylphenoxy)-6-(4-fluorophenethylamino)-N-hydroxyhexanamide | CHEMBL1760323
TypeSmall organic molecule
Emp. Form.C22H28F2N2O3
Mol. Mass.406.4661
SMILESCc1cc(O[C@H](CCCCNCCc2ccc(F)cc2)C(=O)NO)cc(C)c1F