Reaction Details
Target11-beta-hydroxysteroid dehydrogenase 1
LigandBDBM50260623
Substrate/Competitorn/a
Meas. Tech.ChEMBL_740555 (CHEMBL1764756)
IC50 1.7±n/a nM
Citation Sun, WMaletic, MMundt, SSShah, KZokian, HLyons, KWaddell, STBalkovec, J Substituted phenyl triazoles as selective inhibitors of 11 β-Hydroxysteroid Dehydrogenase Type 1. Bioorg Med Chem Lett21:2141-5 (2011) 
 
11-beta-hydroxysteroid dehydrogenase 1
Name:11-beta-hydroxysteroid dehydrogenase 1
Type:Enzyme
Mol. Mass.:32409.16
Organism:Homo sapiens (Human)
Description:P28845
Residue:292
BDBM50260623
NameBDBM50260623
Synonyms:3-(1-(4-chlorophenyl)cyclobutyl)-4-methyl-5-phenyl-4H-1,2,4-triazole | CHEMBL523177
TypeSmall organic molecule
Emp. Form.C19H18ClN3
Mol. Mass.323.819
SMILESCn1c(nnc1C1(CCC1)c1ccc(Cl)cc1)-c1ccccc1