Reaction Details
TargetEpidermal growth factor receptor
LigandBDBM21
Substrate/Competitorn/a
Meas. Tech.ChEMBL_739727 (CHEMBL1763553)
IC50 500±n/a nM
Citation Garofalo, AGoossens, LSix, PLemoine, ARavez, SFarce, ADepreux, P Impact of aryloxy-linked quinazolines: a novel series of selective VEGFR-2 receptor tyrosine kinase inhibitors. Bioorg Med Chem Lett21:2106-12 (2011) 
 
Epidermal growth factor receptor
Name:Epidermal growth factor receptor
Type:Receptor Kinase Domain
Mol. Mass.:134279.59
Organism:Homo sapiens (Human)
Description:P00533
Residue:1210
BDBM21
NameBDBM21
Synonyms:CHEMBL24828 VANDETANIB ZD6474 | cid_3081361
Typen/a
Emp. Form.C22H24BrFN4O2
Mol. Mass.475.354
SMILESCOc1cc2c(Nc3ccc(Br)cc3F)ncnc2cc1OCC1CCN(C)CC1