Reaction Details
TargetInsulin-like growth factor 1 receptor
LigandBDBM50199683
Substrate/Competitorn/a
Meas. Tech.ChEMBL_739832 (CHEMBL1762892)
IC50 520±n/a nM
Citation Crew, APBhagwat, SVDong, HBittner, MAChan, AChen, XCoate, HCooke, AGokhale, PCHonda, AJin, MKahler, JMantis, CMulvihill, MJTavares-Greco, PAVolk, BWang, JWerner, DSArnold, LDPachter, JAWild, RGibson, NW Imidazo[1,5-a]pyrazines: orally efficacious inhibitors of mTORC1 and mTORC2. Bioorg Med Chem Lett21:2092-7 (2011) 
 
Insulin-like growth factor 1 receptor
Name:Insulin-like growth factor 1 receptor
Type:Protein
Mol. Mass.:154776.79
Organism:Homo sapiens (Human)
Description:P08069
Residue:1367
BDBM50199683
NameBDBM50199683
Synonyms:3-(8-amino-3-cyclobutylimidazo[1,5-a]pyrazin-1-yl)phenol | CHEMBL245407
TypeSmall organic molecule
Emp. Form.C16H16N4O
Mol. Mass.280.3244
SMILESNc1nccn2c(nc(-c3cccc(O)c3)c12)C1CCC1