Reaction Details
TargetInsulin-like growth factor 1 receptor
LigandBDBM50339059
Substrate/Competitorn/a
Meas. Tech.ChEMBL_739832 (CHEMBL1762892)
IC50 80±n/a nM
Citation Crew, APBhagwat, SVDong, HBittner, MAChan, AChen, XCoate, HCooke, AGokhale, PCHonda, AJin, MKahler, JMantis, CMulvihill, MJTavares-Greco, PAVolk, BWang, JWerner, DSArnold, LDPachter, JAWild, RGibson, NW Imidazo[1,5-a]pyrazines: orally efficacious inhibitors of mTORC1 and mTORC2. Bioorg Med Chem Lett21:2092-7 (2011) 
 
Insulin-like growth factor 1 receptor
Name:Insulin-like growth factor 1 receptor
Type:Protein
Mol. Mass.:154776.79
Organism:Homo sapiens (Human)
Description:P08069
Residue:1367
BDBM50339059
NameBDBM50339059
Synonyms:3-cyclobutyl-1-(2-phenylquinolin-7-yl)-imidazo[1,5-a]pyrazin-8-ylamine CHEMBL261805
TypeSmall organic molecule
Emp. Form.C25H21N5
Mol. Mass.391.4677
SMILESNc1nccn2c(nc(-c3ccc4ccc(nc4c3)-c3ccccc3)c12)C1CCC1