Reaction Details
TargetCannabinoid receptor 2
LigandBDBM50340998
Substrate/Competitorn/a
Meas. Tech.ChEMBL_740154 (CHEMBL1763214)
EC50 2045±n/a nM
Citation Riether, DWu, LCirillo, PFBerry, AWalker, ERErmann, MNoya-Marino, BJenkins, JEAlbaugh, DAlbrecht, CFisher, MGemkow, MJGrbic, HLöbbe, SMöller, CO'Shea, KSauer, AShih, DTThomson, DS 1,4-Diazepane compounds as potent and selective CB2 agonists: optimization of metabolic stability. Bioorg Med Chem Lett21:2011-6 (2011) 
 
Cannabinoid receptor 2
Name:Cannabinoid receptor 2
Type:G Protein-Coupled Receptor (GPCR)
Mol. Mass.:39690.94
Organism:Homo sapiens (Human)
Description:P34972
Residue:360
BDBM50340998
NameBDBM50340998
Synonyms:CHEMBL1762417 | N-(5-tert-butylisoxazol-3-yl)-4-(tetrahydro-2N-(5-tert-butylisoxazol-3-yl)-4-(tetrahydro-2H-pyran-3-carbonyl)-1,4-diazepane-1-carboxamide
TypeSmall organic molecule
Emp. Form.C19H30N4O4
Mol. Mass.378.4659
SMILESCC(C)(C)c1cc(NC(=O)N2CCCN(CC2)C(=O)C2CCCOC2)no1