Reaction Details
TargetCannabinoid receptor 1
LigandBDBM50341019
Substrate/Competitorn/a
Meas. Tech.ChEMBL_740155 (CHEMBL1763215)
EC50>20000±n/a nM
Citation Riether, DWu, LCirillo, PFBerry, AWalker, ERErmann, MNoya-Marino, BJenkins, JEAlbaugh, DAlbrecht, CFisher, MGemkow, MJGrbic, HLöbbe, SMöller, CO'Shea, KSauer, AShih, DTThomson, DS 1,4-Diazepane compounds as potent and selective CB2 agonists: optimization of metabolic stability. Bioorg Med Chem Lett21:2011-6 (2011) 
 
Cannabinoid receptor 1
Name:Cannabinoid receptor 1
Type:G Protein-Coupled Receptor (GPCR)
Mol. Mass.:52868.96
Organism:Homo sapiens (Human)
Description:P21554
Residue:472
BDBM50341019
NameBDBM50341019
Synonyms:CHEMBL1762289 | N-(4-tert-butylphenyl)-4-(2,5-dichlorobenzoyl)-1,4-diazepane-1-carboxamide
TypeSmall organic molecule
Emp. Form.C23H27Cl2N3O2
Mol. Mass.448.385
SMILESCC(C)(C)c1ccc(NC(=O)N2CCCN(CC2)C(=O)c2cc(Cl)ccc2Cl)cc1