Reaction Details
TargetCannabinoid receptor 1
LigandBDBM50341022
Substrate/Competitorn/a
Meas. Tech.ChEMBL_740155 (CHEMBL1763215)
EC50>20000±n/a nM
Citation Riether, DWu, LCirillo, PFBerry, AWalker, ERErmann, MNoya-Marino, BJenkins, JEAlbaugh, DAlbrecht, CFisher, MGemkow, MJGrbic, HLöbbe, SMöller, CO'Shea, KSauer, AShih, DTThomson, DS 1,4-Diazepane compounds as potent and selective CB2 agonists: optimization of metabolic stability. Bioorg Med Chem Lett21:2011-6 (2011) 
 
Cannabinoid receptor 1
Name:Cannabinoid receptor 1
Type:G Protein-Coupled Receptor (GPCR)
Mol. Mass.:52868.96
Organism:Homo sapiens (Human)
Description:P21554
Residue:472
BDBM50341022
NameBDBM50341022
Synonyms:CHEMBL1762292 | N-(4-tert-butylphenyl)-4-(tetrahydro-2H-pyran-4-carbonyl)-1,4-diazepane-1-carboxamide
TypeSmall organic molecule
Emp. Form.C22H33N3O3
Mol. Mass.387.5157
SMILESCC(C)(C)c1ccc(NC(=O)N2CCCN(CC2)C(=O)C2CCOCC2)cc1