Reaction Details
TargetCannabinoid receptor 1
LigandBDBM50341002
Substrate/Competitorn/a
Meas. Tech.ChEMBL_740155 (CHEMBL1763215)
EC50>20000±n/a nM
Citation Riether, DWu, LCirillo, PFBerry, AWalker, ERErmann, MNoya-Marino, BJenkins, JEAlbaugh, DAlbrecht, CFisher, MGemkow, MJGrbic, HLöbbe, SMöller, CO'Shea, KSauer, AShih, DTThomson, DS 1,4-Diazepane compounds as potent and selective CB2 agonists: optimization of metabolic stability. Bioorg Med Chem Lett21:2011-6 (2011) 
 
Cannabinoid receptor 1
Name:Cannabinoid receptor 1
Type:G Protein-Coupled Receptor (GPCR)
Mol. Mass.:52868.96
Organism:Homo sapiens (Human)
Description:P21554
Residue:472
BDBM50341002
NameBDBM50341002
Synonyms:CHEMBL1762421 | cis-N-(5-tert-butylisoxazol-3-yl)-4-(4-hydroxycyclohexanecarbonyl)-1,4-diazepane-1-carboxamide
TypeSmall organic molecule
Emp. Form.C20H32N4O4
Mol. Mass.392.4925
SMILESCC(C)(C)c1cc(NC(=O)N2CCCN(CC2)C(=O)[C@@H]2CC[C@H](O)CC2)no1