Reaction Details
TargetCannabinoid receptor 1
LigandBDBM50340991
Substrate/Competitorn/a
Meas. Tech.ChEMBL_740155 (CHEMBL1763215)
EC50>20000±n/a nM
Citation Riether, DWu, LCirillo, PFBerry, AWalker, ERErmann, MNoya-Marino, BJenkins, JEAlbaugh, DAlbrecht, CFisher, MGemkow, MJGrbic, HLöbbe, SMöller, CO'Shea, KSauer, AShih, DTThomson, DS 1,4-Diazepane compounds as potent and selective CB2 agonists: optimization of metabolic stability. Bioorg Med Chem Lett21:2011-6 (2011) 
 
Cannabinoid receptor 1
Name:Cannabinoid receptor 1
Type:G Protein-Coupled Receptor (GPCR)
Mol. Mass.:52868.96
Organism:Homo sapiens (Human)
Description:P21554
Residue:472
BDBM50340991
NameBDBM50340991
Synonyms:4-(1,1-Dioxo-1lambda*6*-thiomorpholine-4-carbonyl)-[1,4]diazepane-1-carboxylic acid(5-tert-butyl-isoxazol-3-yl)-amide | CHEMBL1762429
TypeSmall organic molecule
Emp. Form.C18H29N5O5S
Mol. Mass.427.518
SMILESCC(C)(C)c1cc(NC(=O)N2CCCN(CC2)C(=O)N2CCS(=O)(=O)CC2)no1